From nipos, 2 Weeks ago, written in Plain Text.
Embed
  1. warning: `webrender_bindings` (lib) generated 1 warning
  2. warning: `webrender` (lib) generated 3 warnings
  3.    Compiling gkrust v0.1.0 (/export/home/nipos/oi-userland/components/web/firefox/firefox-91.8.0/toolkit/library/rust)
  4.      Running `CARGO=/export/home/nipos/oi-userland/components/web/firefox/build/.rust_up/toolchains/1.59.0-x86_64-unknown-illumos/bin/cargo CARGO_CRATE_NAME=gkrust CARGO_MANIFEST_DIR=/export/home/nipos/oi-userland/components/web/firefox/firefox-91.8.0/toolkit/library/rust CARGO_PKG_AUTHORS='nobody@mozilla.org' CARGO_PKG_DESCRIPTION='Rust code for libxul' CARGO_PKG_HOMEPAGE='' CARGO_PKG_LICENSE=MPL-2.0 CARGO_PKG_LICENSE_FILE='' CARGO_PKG_NAME=gkrust CARGO_PKG_REPOSITORY='' CARGO_PKG_VERSION=0.1.0 CARGO_PKG_VERSION_MAJOR=0 CARGO_PKG_VERSION_MINOR=1 CARGO_PKG_VERSION_PATCH=0 CARGO_PKG_VERSION_PRE='' CARGO_PRIMARY_PACKAGE=1 LD_LIBRARY_PATH='/export/home/nipos/oi-userland/components/web/firefox/build/amd64/release/deps:/export/home/nipos/oi-userland/components/web/firefox/build/.rust_up/toolchains/1.59.0-x86_64-unknown-illumos/lib' /export/home/nipos/oi-userland/components/web/firefox/build/.rust_up/toolchains/1.59.0-x86_64-unknown-illumos/bin/rustc --crate-name gkrust toolkit/library/rust/lib.rs --error-format=json --json=diagnostic-rendered-ansi,future-incompat --crate-type staticlib --emit=dep-info,link -C opt-level=2 -C panic=abort -C embed-bitcode=no -Clto --cfg 'feature="cubeb_pulse_rust"' --cfg 'feature="glean_with_gecko"' --cfg 'feature="moz_places"' --cfg 'feature="quantum_render"' --cfg 'feature="remote_agent"' --cfg 'feature="webgpu"' --cfg 'feature="with_dbus"' -C metadata=9d4217855465238e -C extra-filename=-9d4217855465238e --out-dir /export/home/nipos/oi-userland/components/web/firefox/build/amd64/x86_64-unknown-illumos/release/deps --target x86_64-unknown-illumos -C linker=/export/home/nipos/oi-userland/components/web/firefox/firefox-91.8.0/build/cargo-linker -C incremental=/export/home/nipos/oi-userland/components/web/firefox/build/amd64/x86_64-unknown-illumos/release/incremental -L dependency=/export/home/nipos/oi-userland/components/web/firefox/build/amd64/x86_64-unknown-illumos/release/deps -L dependency=/export/home/nipos/oi-userland/components/web/firefox/build/amd64/release/deps --extern gkrust_shared=/export/home/nipos/oi-userland/components/web/firefox/build/amd64/x86_64-unknown-illumos/release/deps/libgkrust_shared-cdfbef6145254def.rlib --extern mozglue_static=/export/home/nipos/oi-userland/components/web/firefox/build/amd64/x86_64-unknown-illumos/release/deps/libmozglue_static-fbee01851fa00abc.rlib --extern mozilla_central_workspace_hack=/export/home/nipos/oi-userland/components/web/firefox/build/amd64/x86_64-unknown-illumos/release/deps/libmozilla_central_workspace_hack-6bb4468484f6f53f.rlib --extern swgl=/export/home/nipos/oi-userland/components/web/firefox/build/amd64/x86_64-unknown-illumos/release/deps/libswgl-9911aafac8e026a4.rlib --cap-lints warn -Cembed-bitcode=yes -C codegen-units=1 -L native=/export/home/nipos/oi-userland/components/web/firefox/build/amd64/x86_64-unknown-illumos/release/build/lmdb-rkv-sys-83cc3c87bd30830a/out -L native=/export/home/nipos/oi-userland/components/web/firefox/build/amd64/x86_64-unknown-illumos/release/build/mozglue-static-82573d29422bd568/out -L native=/export/home/nipos/oi-userland/components/web/firefox/build/amd64/dist/bin -L native=/export/home/nipos/oi-userland/components/web/firefox/build/amd64/security/nss/lib/nss/nss_nss3 -L native=/export/home/nipos/oi-userland/components/web/firefox/build/amd64/security/nss/lib/ssl/ssl_ssl3 -L native=/export/home/nipos/oi-userland/components/web/firefox/build/amd64/config/external/nspr/pr -L native=/export/home/nipos/oi-userland/components/web/firefox/build/amd64/x86_64-unknown-illumos/release/build/swgl-7c41022672a7f587/out`
  5.     Finished release [optimized] target(s) in 22m 12s
  6. warning: the following packages contain code that will be rejected by a future version of Rust: cascade_bloom_filter v0.1.0 (/export/home/nipos/oi-userland/components/web/firefox/firefox-91.8.0/toolkit/components/cascade_bloom_filter), cert_storage v0.0.1 (/export/home/nipos/oi-userland/components/web/firefox/firefox-91.8.0/security/manager/ssl/cert_storage), rental v0.5.6
  7. note: to see what the problems were, use the option `--future-incompat-report`, or run `cargo report future-incompatibilities --id 1`
  8. make[4]: Verzeichnis „/export/home/nipos/oi-userland/components/web/firefox/build/amd64/toolkit/library/rust“ wird verlassen
  9. make[3]: Verzeichnis „/export/home/nipos/oi-userland/components/web/firefox/build/amd64“ wird verlassen
  10. make[2]: *** [/export/home/nipos/oi-userland/components/web/firefox/firefox-91.8.0/config/recurse.mk:34: compile] Fehler 2
  11. make[2]: Verzeichnis „/export/home/nipos/oi-userland/components/web/firefox/build/amd64“ wird verlassen
  12. make[1]: *** [/export/home/nipos/oi-userland/components/web/firefox/firefox-91.8.0/config/rules.mk:355: default] Fehler 2
  13. make[1]: Verzeichnis „/export/home/nipos/oi-userland/components/web/firefox/build/amd64“ wird verlassen
  14. gmake: *** [/export/home/nipos/oi-userland/make-rules/configure.mk:183: /export/home/nipos/oi-userland/components/web/firefox/build/amd64/.built] Fehler 2